Target
Vascular endothelial growth factor receptor 2
Ligand
BDBM8860
Substrate
Meas. Tech.
Kinase Inhibition Assay
IC50
15±n/a nM
Citation
 Yu, HWang, ZZhang, LZhang, JHuang, Q The discovery of novel vascular endothelial growth factor receptor tyrosine kinases inhibitors: pharmacophore modeling, virtual screening and docking studies. Chem Biol Drug Des 69:204-11 (2007)  
Target
Name:
Vascular endothelial growth factor receptor 2
Synonyms:
CD_antigen=CD309 Fetal liver kinase 1 (FLK-1) KDR Protein-tyrosine kinase receptor Flk-1 VEGFR-2 VEGFR2 Vascular Endothelial Growth Factor Receptor Kinase 2 Vascular endothelial growth factor receptor 2 (KDR) Vascular endothelial growth factor receptor 2 (VEGFR2) Vascular endothelial growth factor receptor-2 (VEGFR-2)
Type:
Receptor Tyrosine Kinase
Mol. Mass.:
151510.97
Organism:
Homo sapiens (Human)
Description:
P35968
Residue:
1356
  
Inhibitor
Name:
BDBM8860
Synonyms:
3-{4-[4-amino-6-(3-hydroxypropyl)thieno[2,3-d]pyrimidin-5-yl]phenyl}-1-(3-methylphenyl)urea KDR Kinase Inhibitor, 4 Thienopyrimidine deriv. 86
Type:
Small organic molecule
Emp. Form.:
C23H23N5O2S
Mol. Mass.:
433.526
SMILES:
Cc1cccc(NC(=O)Nc2ccc(cc2)-c2c(CCCO)sc3ncnc(N)c23)c1
: