Target
Tubulin alpha-1A chain
Ligand
BDBM50035218
Substrate
Meas. Tech.
In Vitro Activity Assay
IC50
1.4e+3± 6e+2 nM
Citation
 Morgan, REAhn, SNzimiro, SFotie, JPhelps, MACotrill, JYakovich, AJSackett, DLDalton, JTWerbovetz, KA Inhibitors of tubulin assembly identified through screening a compound library. Chem Biol Drug Des 72:513-24 (2008)  
Target
Name:
Tubulin alpha-1A chain
Synonyms:
TBA1A_PIG Tubulin Tubulin alpha-1A chain
Type:
Protein
Mol. Mass.:
50049.25
Organism:
Sus scrofa (Pig)
Description:
P02550
Residue:
451
  
Inhibitor
Name:
BDBM50035218
Synonyms:
CHEMBL61 Podophyllinic acid lactone podophyllotoxin
Type:
Small organic molecule
Emp. Form.:
C22H22O8
Mol. Mass.:
414.4053
SMILES:
COc1cc(cc(OC)c1OC)[C@H]1[C@@H]2[C@H](COC2=O)[C@@H](O)c2cc3OCOc3cc12
: