Target
Muscarinic acetylcholine receptor M2
Ligand
BDBM81771
Substrate
Ki
2400±n/a nM
Comments
PDSP_1200
Citation
 Bolden, CCusack, BRichelson, E Antagonism by antimuscarinic and neuroleptic compounds at the five cloned human muscarinic cholinergic receptors expressed in Chinese hamster ovary cells. J Pharmacol Exp Ther 260:576-80 (1992) Target
Name:
Muscarinic acetylcholine receptor M2
Synonyms:
ACM2_HUMAN Cholinergic, muscarinic M2 Muscarinic acetylcholine receptor M2 and M5 | RecName: Full=Muscarinic acetylcholine receptor M2
Type:
GPCR
Mol. Mass.:
51730.61
Organism:
Homo sapiens (Human)
Description:
P08172
Residue:
466
  
Inhibitor
Name:
BDBM81771
Synonyms:
CAS_3575-80-2 NSC_15387
Type:
Small organic molecule
Emp. Form.:
C16H22FNO
Mol. Mass.:
263.3504
SMILES:
CC1CCN(CCCC(=O)c2ccc(F)cc2)CC1
: