Target
Muscarinic acetylcholine receptor M2
Ligand
BDBM50015720
Substrate
Ki
2±n/a nM
Comments
PDSP_1688
Citation
 Bolden, CCusack, BRichelson, E Antagonism by antimuscarinic and neuroleptic compounds at the five cloned human muscarinic cholinergic receptors expressed in Chinese hamster ovary cells. J Pharmacol Exp Ther 260:576-80 (1992) Target
Name:
Muscarinic acetylcholine receptor M2
Synonyms:
ACM2_HUMAN Cholinergic, muscarinic M2 Muscarinic acetylcholine receptor M2 and M5 | RecName: Full=Muscarinic acetylcholine receptor M2
Type:
GPCR
Mol. Mass.:
51730.61
Organism:
Homo sapiens (Human)
Description:
P08172
Residue:
466
  
Inhibitor
Name:
BDBM50015720
Synonyms:
(hyoscine)3-Hydroxy-2-phenyl-propionic acid 9-methyl-3-oxa-9-aza-tricyclo[3.3.1.0*2,4*]non-7-yl ester 9-methyl-3-oxa-9-azatricyclo[3.3.1.02,4]non-7-yl 3-hydroxy-2-phenylpropanoate CHEMBL13030 SCOPOLAMINE
Type:
Small organic molecule
Emp. Form.:
C17H21NO4
Mol. Mass.:
303.3529
SMILES:
CN1C2CC(CC1C1OC21)OC(=O)C(CO)c1ccccc1
: