Target
Muscarinic acetylcholine receptor M3
Ligand
BDBM22871
Substrate
Ki
390±n/a nM
Comments
PDSP_1090
Citation
 Bolden, CCusack, BRichelson, E Antagonism by antimuscarinic and neuroleptic compounds at the five cloned human muscarinic cholinergic receptors expressed in Chinese hamster ovary cells. J Pharmacol Exp Ther 260:576-80 (1992) Target
Name:
Muscarinic acetylcholine receptor M3
Synonyms:
ACM3_HUMAN Cholinergic, muscarinic M3 Muscarinic receptor M3 | RecName: Full=Muscarinic acetylcholine receptor M3
Type:
Enzyme
Mol. Mass.:
66151.03
Organism:
Homo sapiens (Human)
Description:
P20309
Residue:
590
  
Inhibitor
Name:
BDBM22871
Synonyms:
13-chloro-10-(4-methylpiperazin-1-yl)-2-oxa-9-azatricyclo[9.4.0.0^{3,8}]pentadeca-1(11),3,5,7,9,12,14-heptaene 8-chloro-6-(4-methylpiperazino)benzo[b][1,4]benzoxazepine;succinic acid CL71,563 Loxapine
Type:
Small organic molecule
Emp. Form.:
C18H18ClN3O
Mol. Mass.:
327.808
SMILES:
CN1CCN(CC1)C1=Nc2ccccc2Oc2ccc(Cl)cc12
: