Target
5-hydroxytryptamine receptor 2A
Ligand
BDBM50024204
Substrate
Ki
3.1±n/a nM
Comments
PDSP_1206
Citation
 Roth, BLCiaranello, RDMeltzer, HY Binding of typical and atypical antipsychotic agents to transiently expressed 5-HT1C receptors. J Pharmacol Exp Ther 260:1361-5 (1992) Target
Name:
5-hydroxytryptamine receptor 2A
Synonyms:
5-HT-2A 5-HT2A 5-hydroxytryptamine receptor 2A (5HT2A) Htr2 Serotonin Receptor 2A
Type:
G Protein-Coupled Receptor (GPCR)
Mol. Mass.:
52852.05
Organism:
Rattus norvegicus (rat)
Description:
Rat cortex membranes 5-HT2A receptors.
Residue:
471
  
Inhibitor
Name:
BDBM50024204
Synonyms:
1H-imidazo[4,5-c]pyridine derivative 4,7-dimethyl-(6aR,9S,10aR)-4,6,6a,7,8,9,10,10a-octahydroindolo[4,3-fg]quinolin-9-amino-N,N-dimethyl sulfonamide 9-N,N-dimethylsulfamide-4,7-dimethyl-4,6,6a,7,8,9,10,10a-octahydro-indolo[4,3-fg]quinoline ChEMBL_10959 N'-4,7-Dimethyl-4,6,6a,7,8,9,10,10a-octahydro-indolo[4,3-fg]quinolin-9-yl)-N'-,N'-dimethyl-sulphonediamine
Type:
Small organic molecule
Emp. Form.:
C18H26N4O2S
Mol. Mass.:
362.49
SMILES:
CN(C)S(=O)(=O)N[C@H]1C[C@H]2[C@@H](Cc3cn(C)c4cccc2c34)N(C)C1
: