Target
5-hydroxytryptamine receptor 2C
Ligand
BDBM50014407
Substrate
Ki
336±n/a nM
Comments
PDSP_1578
Citation
 Roth, BLCiaranello, RDMeltzer, HY Binding of typical and atypical antipsychotic agents to transiently expressed 5-HT1C receptors. J Pharmacol Exp Ther 260:1361-5 (1992) Target
Name:
5-hydroxytryptamine receptor 2C
Synonyms:
5-HT2C 5-hydroxytryptamine receptor 2C (5HT2c) 5ht1c Htr2c Serotonin receptor 2a and 2c (5HT2A and 5HT2C)
Type:
Enzyme
Mol. Mass.:
51935.10
Organism:
Rattus norvegicus (Rat)
Description:
P08909
Residue:
460
  
Inhibitor
Name:
BDBM50014407
Synonyms:
2-(piperazin-1-yl)quinoline 2-Piperazin-1-yl-quinoline (Quipazine) CHEMBL18772 | QUIPAZINE
Type:
Small organic molecule
Emp. Form.:
C13H15N3
Mol. Mass.:
213.2783
SMILES:
C1CN(CCN1)c1ccc2ccccc2n1
: