Target
Protachykinin-1
Ligand
BDBM50010685
Substrate
Ki
>10000±n/a nM
Comments
PDSP_664
Citation
 Mottola, DMBrewster, WKCook, LLNichols, DEMailman, RB Dihydrexidine, a novel full efficacy D1 dopamine receptor agonist. J Pharmacol Exp Ther 262:383-93 (1992) Target
Name:
Protachykinin-1
Synonyms:
Nka Protachykinin-1 Substance P Tac1 | Tac2
Type:
Enzyme Catalytic Domain
Mol. Mass.:
15007.06
Organism:
RAT
Description:
Substance K 0 RAT::P06767
Residue:
130
  
Inhibitor
Name:
BDBM50010685
Synonyms:
(+/-)-trans-10,11-dihydroxy-5,6,6a,7,8,12b-hexahydrobenzo[a]phenanthridine 5,6,6a,7,8,12b-Hexahydro-benzo[a]phenanthridine-10,11-diol Dihydrexidine, DHX
Type:
Small organic molecule
Emp. Form.:
C17H17NO2
Mol. Mass.:
267.3224
SMILES:
Oc1cc2CC[C@H]3NCc4ccccc4[C@H]3c2cc1O
: