Target
Alpha-2C adrenergic receptor
Ligand
BDBM31046
Substrate
Ki
12.7±n/a nM
Comments
PDSP_1479
Citation
 Bylund, DBBlaxall, HSIversen, LJCaron, MGLefkowitz, RJLomasney, JW Pharmacological characteristics of alpha 2-adrenergic receptors: comparison of pharmacologically defined subtypes with subtypes identified by molecular cloning. Mol Pharmacol 42:1-5 (1992) Target
Name:
Alpha-2C adrenergic receptor
Synonyms:
ADA2C_HUMAN ADRA2L2 Adrenergic alpha2C Adrenergic receptor alpha Alpha-2 adrenergic receptor subtype C4 Alpha-2C adrenoreceptor | adrenergic, alpha-2C-, receptor [Homo sapiens]
Type:
Enzyme
Mol. Mass.:
49552.32
Organism:
Homo sapiens (Human)
Description:
P18825
Residue:
462
  
Inhibitor
Name:
BDBM31046
Synonyms:
3-[4,5-dihydro-1H-imidazol-2-ylmethyl-(4-methylphenyl)amino]phenol;methanesulfonic acid 3-[N-(2-imidazolin-2-ylmethyl)-4-methyl-anilino]phenol;mesylic acid MLS000069487 PHENTOLAMINE MESYLATE cid_5775 | cid_91430
Type:
Small organic molecule
Emp. Form.:
C17H19N3O
Mol. Mass.:
281.3523
SMILES:
Cc1ccc(cc1)N(CC1=NCCN1)c1cccc(O)c1
: