Target
5-hydroxytryptamine receptor 2A
Ligand
BDBM50004822
Substrate
Ki
>10000±n/a nM
Comments
PDSP_1719
Citation
 Andersen, PHGrønvald, FCHohlweg, RHansen, LBGuddal, EBraestrup, CNielsen, EB NNC-112, NNC-687 and NNC-756, new selective and highly potent dopamine D1 receptor antagonists. Eur J Pharmacol 219:45-52 (1992)  
Target
Name:
5-hydroxytryptamine receptor 2A
Synonyms:
5-HT-2A 5-HT2A 5-hydroxytryptamine receptor 2A (5HT2A) Htr2 Serotonin Receptor 2A
Type:
G Protein-Coupled Receptor (GPCR)
Mol. Mass.:
52852.05
Organism:
Rattus norvegicus (rat)
Description:
Rat cortex membranes 5-HT2A receptors.
Residue:
471
  
Inhibitor
Name:
BDBM50004822
Synonyms:
(R)-1-phenyl-2,3,4,5-tetrahydro-1H-benzo[d]azepine-7,8-diol 1-Phenyl-2,3,4,5-tetrahydro-1H-benzo[d]azepine-7,8-diol 7,8-Dihydroxy-1-phenyl-2,3,4,5-tetrahydro-1H-benzo[d]azepinium(R(+)SKF38393) CHEMBL24077 SK&F-383933 SK-383933 SKF 38393 (+)
Type:
Small organic molecule
Emp. Form.:
C16H17NO2
Mol. Mass.:
255.3117
SMILES:
Oc1cc2CCNC[C@H](c3ccccc3)c2cc1O
: