Target
Adenosine receptor A2a
Ligand
BDBM81788
Substrate
Ki
140±n/a nM
Comments
PDSP_2628
Citation
 Daly, JWPadgett, WL Agonist activity of 2- and 5'-substituted adenosine analogs and their N6-cycloalkyl derivatives at A1- and A2-adenosine receptors coupled to adenylate cyclase. Biochem Pharmacol 43:1089-93 (1992)  
Target
Name:
Adenosine receptor A2a
Synonyms:
AA2AR_RAT Adenosine A2 receptor Adenosine Receptors A2a (A2a) Adenosine receptors A2a Rat striatal adenosine A2a receptor
Type:
G Protein-Coupled Receptor (GPCR)
Mol. Mass.:
45015.65
Organism:
Rattus norvegicus (rat)
Description:
Rat A2A receptors expressed in CHO cells.
Residue:
410
  
Inhibitor
Name:
BDBM81788
Synonyms:
5'-Chloro Adenosine | 5'-ChloroAdo
Type:
Emp. Form.:
C9H10ClN5O3
Mol. Mass.:
271.66
SMILES:
Nc1ncnc2n(cnc12)[C@@H]1O[C@H](Cl)[C@@H](O)[C@H]1O
: