Target
5-hydroxytryptamine receptor 1B
Ligand
BDBM21397
Substrate
Ki
995±n/a nM
Comments
PDSP_1739
Citation
 Weinshank, RLZgombick, JMMacchi, MJBranchek, TAHartig, PR Human serotonin 1D receptor is encoded by a subfamily of two distinct genes: 5-HT1D alpha and 5-HT1D beta. Proc Natl Acad Sci U S A 89:3630-4 (1992)  
Target
Name:
5-hydroxytryptamine receptor 1B
Synonyms:
5-HT-1B 5-HT1B 5HT1B_HUMAN HTR1DB Serotonin (5-HT) receptor Serotonin Receptor 1B
Type:
G Protein-Coupled Receptor (GPCR)
Mol. Mass.:
43579.17
Organism:
Homo sapiens (Human)
Description:
Receptor binding assays were performed using human clone stably expressed in CHO cells
Residue:
390
  
Inhibitor
Name:
BDBM21397
Synonyms:
8-[4-(4-fluorophenyl)-4-keto-butyl]-1-phenyl-1,3,8-triazaspiro[4.5]decan-4-one 8-[4-(4-fluorophenyl)-4-oxobutyl]-1-phenyl-1,3,8-triazaspiro[4.5]decan-4-one MLS000028615 SPIPERONE US9359372, Spiperone cid_5265
Type:
radiolabeled ligand
Emp. Form.:
C23H26FN3O2
Mol. Mass.:
395.4698
SMILES:
Fc1ccc(cc1)C(=O)CCCN1CCC2(CC1)N(CNC2=O)c1ccccc1
: