Target
D(2) dopamine receptor
Ligand
BDBM81792
Substrate
Ki
36±n/a nM
Comments
PDSP_1941
Citation
 Sokoloff, PGiros, BMartres, MPAndrieux, MBesancon, RPilon, CBouthenet, MLSouil, ESchwartz, JC Localization and function of the D3 dopamine receptor. Arzneimittelforschung 42:224-30 (1992) Target
Name:
D(2) dopamine receptor
Synonyms:
D(2) dopamine receptor DOPAMINE D2 Long DRD2 Dopamine D2 receptor Dopamine D2 receptor (D2R) Dopamine2-like | d2
Type:
Cell-surface receptors
Mol. Mass.:
50647.10
Organism:
Homo sapiens (Human)
Description:
P14416
Residue:
443
  
Inhibitor
Name:
BDBM81792
Synonyms:
CAS_5311190 UH232 | UH232(+)
Type:
Small organic molecule
Emp. Form.:
C18H27NO
Mol. Mass.:
273.4131
SMILES:
CCCN(CCC)C1C=Cc2c(OC)cccc2C1C
: