Target
D(3) dopamine receptor
Ligand
BDBM50016017
Substrate
Ki
3.6±n/a nM
Comments
PDSP_1572
Citation
 Sokoloff, PGiros, BMartres, MPAndrieux, MBesancon, RPilon, CBouthenet, MLSouil, ESchwartz, JC Localization and function of the D3 dopamine receptor. Arzneimittelforschung 42:224-30 (1992) Target
Name:
D(3) dopamine receptor
Synonyms:
DOPAMINE D3 DRD3_HUMAN Dopamine D3 receptor (D3) Dopamine receptor Dopamine receptor D3
Type:
Mol. Mass.:
44243.43
Organism:
Homo sapiens (Human)
Description:
Residue:
400
  
Inhibitor
Name:
BDBM50016017
Synonyms:
(5aR,9aR)-6-Propyl-5,5a,6,7,8,9,9a,10-octahydro-pyrido[2,3-g]quinazolin-2-ylamine 6-Propyl-5,5a,6,7,8,9,9a,10-octahydro-pyrido[2,3-g]quinazolin-2-ylamine(Quinelorane) Quinelorane | Quinerolane
Type:
Small organic molecule
Emp. Form.:
C14H22N4
Mol. Mass.:
246.3513
SMILES:
CCCN1CCC[C@@H]2Cc3nc(N)ncc3C[C@@H]12
: