Target
Alpha-2A adrenergic receptor
Ligand
BDBM81805
Substrate
Ki
38±n/a nM
Comments
PDSP_338
Citation
 Blaxall, HSMurphy, TJBaker, JCRay, CBylund, DB Characterization of the alpha-2C adrenergic receptor subtype in the opossum kidney and in the OK cell line. J Pharmacol Exp Ther 259:323-9 (1991) Target
Name:
Alpha-2A adrenergic receptor
Synonyms:
ADA2A_HUMAN ADRA2R Adrenergic alpha2A Alpha-2 adrenergic receptor subtype C10 Alpha-2A adrenoreceptor alpha-2A adrenergic receptor [Homo sapiens]
Type:
Enzyme
Mol. Mass.:
48979.91
Organism:
Homo sapiens (Human)
Description:
P08913
Residue:
450
  
Inhibitor
Name:
BDBM81805
Synonyms:
AZAPETINE NSC_8966
Type:
Small organic molecule
Emp. Form.:
C17H17N
Mol. Mass.:
235.3236
SMILES:
C=CCN1Cc2ccccc2-c2ccccc2C1
: