Target
Alpha-2A adrenergic receptor
Ligand
BDBM50030623
Substrate
Ki
32±n/a nM
Comments
PDSP_1716
Citation
 Blaxall, HSMurphy, TJBaker, JCRay, CBylund, DB Characterization of the alpha-2C adrenergic receptor subtype in the opossum kidney and in the OK cell line. J Pharmacol Exp Ther 259:323-9 (1991) Target
Name:
Alpha-2A adrenergic receptor
Synonyms:
ADA2A_HUMAN ADRA2R Adrenergic alpha2A Alpha-2 adrenergic receptor subtype C10 Alpha-2A adrenoreceptor alpha-2A adrenergic receptor [Homo sapiens]
Type:
Enzyme
Mol. Mass.:
48979.91
Organism:
Homo sapiens (Human)
Description:
P08913
Residue:
450
  
Inhibitor
Name:
BDBM50030623
Synonyms:
6-Chloro-3-methyl-9-(3-methyl-but-2-enyloxy)-2,3,4,5-tetrahydro-1H-benzo[d]azepine SK&F-104078 SKF 104078
Type:
Small organic molecule
Emp. Form.:
C16H22ClNO
Mol. Mass.:
279.805
SMILES:
[#6]-[#7]-1-[#6]-[#6]-c2c(Cl)ccc(-[#8]-[#6]\[#6]=[#6](\[#6])-[#6])c2-[#6]-[#6]-1
: