Target
Alpha-2A adrenergic receptor
Ligand
BDBM81808
Substrate
Ki
2.2±n/a nM
Comments
PDSP_1967
Citation
 Blaxall, HSMurphy, TJBaker, JCRay, CBylund, DB Characterization of the alpha-2C adrenergic receptor subtype in the opossum kidney and in the OK cell line. J Pharmacol Exp Ther 259:323-9 (1991) Target
Name:
Alpha-2A adrenergic receptor
Synonyms:
ADA2A_HUMAN ADRA2R Adrenergic alpha2A Alpha-2 adrenergic receptor subtype C10 Alpha-2A adrenoreceptor alpha-2A adrenergic receptor [Homo sapiens]
Type:
Enzyme
Mol. Mass.:
48979.91
Organism:
Homo sapiens (Human)
Description:
P08913
Residue:
450
  
Inhibitor
Name:
BDBM81808
Synonyms:
CAS_133816 WY 26392
Type:
Small organic molecule
Emp. Form.:
C17H26N2O2S
Mol. Mass.:
322.466
SMILES:
CCCS(=O)(=O)N(C)C1CCN2CCc3ccccc3C2C1
: