Target
Alpha-2B adrenergic receptor
Ligand
BDBM81815
Substrate
Ki
0.48±n/a nM
Comments
PDSP_1049
Citation
 Blaxall, HSMurphy, TJBaker, JCRay, CBylund, DB Characterization of the alpha-2C adrenergic receptor subtype in the opossum kidney and in the OK cell line. J Pharmacol Exp Ther 259:323-9 (1991) Target
Name:
Alpha-2B adrenergic receptor
Synonyms:
ADA2B_RAT Adrenergic receptor alpha Alpha-2B adrenergic receptor Alpha-2B adrenoreceptor | adrenergic Alpha2B
Type:
Enzyme Catalytic Domain
Mol. Mass.:
50379.83
Organism:
NEONATAL RAT
Description:
adrenergic Alpha2B ADRA2B NEONATAL RAT::P19328
Residue:
453
  
Inhibitor
Name:
BDBM81815
Synonyms:
CAS_196343 NSC_196343
Type:
Small organic molecule
Emp. Form.:
C46H67N9O9S2
Mol. Mass.:
954.209
SMILES:
CCOc1ccc(CC(NC(=O)CC2(S)CCCCC2)C(=O)NC(Cc2ccccc2)C(=O)NC(C(C)C)C(=O)NC(CC(N)=O)C(=O)NC(C=S)C(=O)NC(CCCCN)C(N)=O)cc1
: