Target
Alpha-2B adrenergic receptor
Ligand
BDBM81803
Substrate
Ki
0.58±n/a nM
Comments
PDSP_1647
Citation
 Blaxall, HSMurphy, TJBaker, JCRay, CBylund, DB Characterization of the alpha-2C adrenergic receptor subtype in the opossum kidney and in the OK cell line. J Pharmacol Exp Ther 259:323-9 (1991) Target
Name:
Alpha-2B adrenergic receptor
Synonyms:
ADA2B_RAT Adrenergic receptor alpha Alpha-2B adrenergic receptor Alpha-2B adrenoreceptor | adrenergic Alpha2B
Type:
Enzyme Catalytic Domain
Mol. Mass.:
50379.83
Organism:
NEONATAL RAT
Description:
adrenergic Alpha2B ADRA2B NEONATAL RAT::P19328
Residue:
453
  
Inhibitor
Name:
BDBM81803
Synonyms:
CAS_125992 RX 811033
Type:
Small organic molecule
Emp. Form.:
C13H16N2O3
Mol. Mass.:
248.2777
SMILES:
CCOC1(COc2ccccc2O1)C1=NCCN1
: