Target
Alpha-2B adrenergic receptor
Ligand
BDBM81806
Substrate
Ki
0.27±n/a nM
Comments
PDSP_1964
Citation
 Blaxall, HSMurphy, TJBaker, JCRay, CBylund, DB Characterization of the alpha-2C adrenergic receptor subtype in the opossum kidney and in the OK cell line. J Pharmacol Exp Ther 259:323-9 (1991) Target
Name:
Alpha-2B adrenergic receptor
Synonyms:
ADA2B_RAT Adrenergic receptor alpha Alpha-2B adrenergic receptor Alpha-2B adrenoreceptor | adrenergic Alpha2B
Type:
Enzyme Catalytic Domain
Mol. Mass.:
50379.83
Organism:
NEONATAL RAT
Description:
adrenergic Alpha2B ADRA2B NEONATAL RAT::P19328
Residue:
453
  
Inhibitor
Name:
BDBM81806
Synonyms:
2-(4,5-dihydro-1h-imidazol-2-yl)-2,3-dihydro-1-(2-propenyl)-1h-indole mono(4-methylbenzenesulfonate) WIN 53782
Type:
Emp. Form.:
C14H15N3
Mol. Mass.:
225.289
SMILES:
C=CCn1c(cc2ccccc12)C1=NCCN1
: