Target
Alpha-2C adrenergic receptor
Ligand
BDBM50017720
Substrate
Ki
1.3±n/a nM
Comments
PDSP_1500
Citation
 Blaxall, HSMurphy, TJBaker, JCRay, CBylund, DB Characterization of the alpha-2C adrenergic receptor subtype in the opossum kidney and in the OK cell line. J Pharmacol Exp Ther 259:323-9 (1991) Target
Name:
Alpha-2C adrenergic receptor
Synonyms:
ADRA2C | adrenergic Alpha2C
Type:
Enzyme Catalytic Domain
Mol. Mass.:
27257.01
Organism:
OK
Description:
adrenergic Alpha2C ADRA2C OK::G3GWB4
Residue:
230
  
Inhibitor
Name:
BDBM50017720
Synonyms:
1-(2,3-Dihydro-benzo[1,4]dioxin-2-ylmethyl)-piperidine CHEMBL31836 Piperoxan
Type:
Small organic molecule
Emp. Form.:
C14H19NO2
Mol. Mass.:
233.3062
SMILES:
C(C1COc2ccccc2O1)N1CCCCC1
: