Target
Alpha-2C adrenergic receptor
Ligand
BDBM81806
Substrate
Ki
0.05±n/a nM
Comments
PDSP_1964
Citation
 Blaxall, HSMurphy, TJBaker, JCRay, CBylund, DB Characterization of the alpha-2C adrenergic receptor subtype in the opossum kidney and in the OK cell line. J Pharmacol Exp Ther 259:323-9 (1991) Target
Name:
Alpha-2C adrenergic receptor
Synonyms:
ADRA2C | adrenergic Alpha2C
Type:
Enzyme Catalytic Domain
Mol. Mass.:
27257.01
Organism:
OK
Description:
adrenergic Alpha2C ADRA2C OK::G3GWB4
Residue:
230
  
Inhibitor
Name:
BDBM81806
Synonyms:
2-(4,5-dihydro-1h-imidazol-2-yl)-2,3-dihydro-1-(2-propenyl)-1h-indole mono(4-methylbenzenesulfonate) WIN 53782
Type:
Emp. Form.:
C14H15N3
Mol. Mass.:
225.289
SMILES:
C=CCn1c(cc2ccccc12)C1=NCCN1
: