Target
Voltage-dependent calcium channel gamma-1 subunit
Ligand
BDBM81818
Substrate
Ki
>10000±n/a nM
Comments
PDSP_2651
Citation
 Garritsen, AIjzerman, APTulp, MTCragoe, EJSoudijn, W Receptor binding profiles of amiloride analogues provide no evidence for a link between receptors and the Na+/H+ exchanger, but indicate a common structure on receptor proteins. J Recept Res 11:891-907 (1991)  
Target
Name:
Voltage-dependent calcium channel gamma-1 subunit
Synonyms:
CACNG1 CCG1_HUMAN Voltage-dependent calcium channel gamma-1 subunit
Type:
Enzyme Catalytic Domain
Mol. Mass.:
25030.69
Organism:
Homo sapiens (Human)
Description:
Calcium channel (DHP) 0 0::Q06432
Residue:
222
  
Inhibitor
Name:
BDBM81818
Synonyms:
CAS_1794 HMA | NSC_1794
Type:
Small organic molecule
Emp. Form.:
C12H18ClN7O
Mol. Mass.:
311.771
SMILES:
NC(=N)NC(=O)c1nc(Cl)c(nc1N)N1CCCCCC1
: