Target
Protachykinin-1
Ligand
BDBM81819
Substrate
Ki
>10000±n/a nM
Comments
PDSP_2652
Citation
 Garritsen, AIjzerman, APTulp, MTCragoe, EJSoudijn, W Receptor binding profiles of amiloride analogues provide no evidence for a link between receptors and the Na+/H+ exchanger, but indicate a common structure on receptor proteins. J Recept Res 11:891-907 (1991)  
Target
Name:
Protachykinin-1
Synonyms:
Nka Protachykinin-1 Substance P Tac1 | Tac2
Type:
Enzyme Catalytic Domain
Mol. Mass.:
15007.06
Organism:
RAT
Description:
Substance K 0 RAT::P06767
Residue:
130
  
Inhibitor
Name:
BDBM81819
Synonyms:
Benzamil CHEMBL212579 | NSC_108107
Type:
Small organic molecule
Emp. Form.:
C13H14ClN7O
Mol. Mass.:
319.75
SMILES:
NC(NC(=O)c1nc(Cl)c(N)nc1N)=NCc1ccccc1
: