Target
Pituitary adenylate cyclase-activating polypeptide
Ligand
BDBM81330
Substrate
Ki
600±n/a nM
Comments
PDSP_2615
Citation
 Schäfer, HSchwarzhoff, RCreutzfeldt, WSchmidt, WE Characterization of a guanosine-nucleotide-binding-protein-coupled receptor for pituitary adenylate-cyclase-activating polypeptide on plasma membranes from rat brain. Eur J Biochem 202:951-8 (1991)  
Target
Name:
Pituitary adenylate cyclase-activating polypeptide
Synonyms:
Adcyap1 PACAP-27 PACA_RAT | Pituitary adenylate cyclase-activating polypeptide
Type:
Enzyme Catalytic Domain
Mol. Mass.:
19565.66
Organism:
RAT
Description:
PACAP 0 RAT::P13589
Residue:
175
  
Inhibitor
Name:
BDBM81330
Synonyms:
+ 1 mM GTP | GTP
Type:
Small organic molecule
Emp. Form.:
C10H13N5O14P3
Mol. Mass.:
520.1583
SMILES:
Nc1nc2n(cnc2c(=O)[nH]1)[C@@H]1O[C@H](COP([O-])(=O)OP([O-])(=O)OP(O)([O-])=O)C(O)C1O
: