Target
Pituitary adenylate cyclase-activating polypeptide
Ligand
BDBM81823
Substrate
Ki
40±n/a nM
Comments
PDSP_2613
Citation
 Schäfer, HSchwarzhoff, RCreutzfeldt, WSchmidt, WE Characterization of a guanosine-nucleotide-binding-protein-coupled receptor for pituitary adenylate-cyclase-activating polypeptide on plasma membranes from rat brain. Eur J Biochem 202:951-8 (1991)  
Target
Name:
Pituitary adenylate cyclase-activating polypeptide
Synonyms:
Adcyap1 PACAP-27 PACA_RAT | Pituitary adenylate cyclase-activating polypeptide
Type:
Enzyme Catalytic Domain
Mol. Mass.:
19565.66
Organism:
RAT
Description:
PACAP 0 RAT::P13589
Residue:
175
  
Inhibitor
Name:
BDBM81823
Synonyms:
CAS_444121 NSC_444121
Type:
Small organic molecule
Emp. Form.:
C10H16N5O13P3S
Mol. Mass.:
539.246
SMILES:
Nc1nc2n(cnc2c(=O)[nH]1)C1OC(COP(O)(=O)OP(O)(=O)OP(O)(S)=O)C(O)C1O
: