Target
Alpha-1A adrenergic receptor
Ligand
BDBM36024
Substrate
Ki
>10000±n/a nM
Comments
PDSP_1482
Citation
 Lomasney, JWCotecchia, SLorenz, WLeung, WYSchwinn, DAYang-Feng, TLBrownstein, MLefkowitz, RJCaron, MG Molecular cloning and expression of the cDNA for the alpha 1A-adrenergic receptor. The gene for which is located on human chromosome 5. J Biol Chem 266:6365-9 (1991) Target
Name:
Alpha-1A adrenergic receptor
Synonyms:
ADA1A_BOVIN ADRA1C Alpha 1A-adrenoreceptor Cerebral cortex alpha adrenergic receptor | adrenergic Alpha1
Type:
Enzyme Catalytic Domain
Mol. Mass.:
51492.08
Organism:
CALF
Description:
adrenergic Alpha1 0 CALF
Residue:
466
  
Inhibitor
Name:
BDBM36024
Synonyms:
(R)-(-)-phenylephrine Phenylephrine,(-)
Type:
Guest
Emp. Form.:
C9H14NO2
Mol. Mass.:
168.2124
SMILES:
C[NH2+]C[C@H](O)c1cccc(O)c1
: