Target
D(1A) dopamine receptor
Ligand
BDBM35234
Substrate
Ki
>10000±n/a nM
Comments
PDSP_1348
Citation
 Sunahara, RKGuan, HCO'Dowd, BFSeeman, PLaurier, LGNg, GGeorge, SRTorchia, JVan Tol, HHNiznik, HB Cloning of the gene for a human dopamine D5 receptor with higher affinity for dopamine than D1. Nature 350:614-9 (1991)  
Target
Name:
D(1A) dopamine receptor
Synonyms:
DA D1 receptor DRD1 Dopamine D1 receptor Dopamine D1A
Type:
Enzyme
Mol. Mass.:
49303.43
Organism:
Homo sapiens (Human)
Description:
P21728
Residue:
446
  
Inhibitor
Name:
BDBM35234
Synonyms:
DL-[7-3H]norepinephrine Noradrenaline,(+) | [3H]NE
Type:
radiolabeled ligand
Emp. Form.:
C8H11NO3
Mol. Mass.:
169.1778
SMILES:
NCC(O)c1ccc(O)c(O)c1
: