Target
Dopamine receptor D4
Ligand
BDBM81195
Substrate
Ki
24±n/a nM
Comments
PDSP_239
Citation
 Van Tol, HHBunzow, JRGuan, HCSunahara, RKSeeman, PNiznik, HBCivelli, O Cloning of the gene for a human dopamine D4 receptor with high affinity for the antipsychotic clozapine. Nature 350:610-4 (1991)  
Target
Name:
Dopamine receptor D4
Synonyms:
DOPAMINE D2 Long DRD2 | Dopamine receptor D4
Type:
Enzyme Catalytic Domain
Mol. Mass.:
43731.97
Organism:
CANINE
Description:
Q589Y6
Residue:
421
  
Inhibitor
Name:
BDBM81195
Synonyms:
(+/-)-2-Amino-6,7-dihydroxy-1,2,3,4-tetrahydronaphthalene hydrobromide 6-Amino-5,6,7,8-tetrahydro-naphthalene-2,3-diol 6-azanyl-5,6,7,8-tetrahydronaphthalene-2,3-diol;hydrobromide ADTN, (+) CHEMBL26736 SMR001254097 cid_3153
Type:
Small organic molecule
Emp. Form.:
C10H13NO2
Mol. Mass.:
179.2157
SMILES:
NC1CCc2cc(O)c(O)cc2C1
: