Target
D(4) dopamine receptor
Ligand
BDBM21398
Substrate
Ki
5.1±n/a nM
Comments
PDSP_918
Citation
 Van Tol, HHBunzow, JRGuan, HCSunahara, RKSeeman, PNiznik, HBCivelli, O Cloning of the gene for a human dopamine D4 receptor with high affinity for the antipsychotic clozapine. Nature 350:610-4 (1991)  
Target
Name:
D(4) dopamine receptor
Synonyms:
D(4) dopamine receptor DOPAMINE D4.4 Dopamine receptor | Drd4
Type:
Enzyme Catalytic Domain
Mol. Mass.:
41307.65
Organism:
RAT
Description:
DOPAMINE D4.4 0 RAT::P30729
Residue:
387
  
Inhibitor
Name:
BDBM21398
Synonyms:
4-[4-(4-Chloro-phenyl)-4-hydroxy-piperidin-1-yl]-1-(4-fluoro-phenyl)-butan-1-one;propionate(HCl) CHEMBL54 Haloperidol | Haloperidol, 1
Type:
Small organic molecule
Emp. Form.:
C21H23ClFNO2
Mol. Mass.:
375.864
SMILES:
OC1(CCN(CCCC(=O)c2ccc(F)cc2)CC1)c1ccc(Cl)cc1
: