Target
Dopamine receptor D4
Ligand
BDBM84637
Substrate
Ki
46±n/a nM
Comments
PDSP_1576
Citation
 Van Tol, HHBunzow, JRGuan, HCSunahara, RKSeeman, PNiznik, HBCivelli, O Cloning of the gene for a human dopamine D4 receptor with high affinity for the antipsychotic clozapine. Nature 350:610-4 (1991)  
Target
Name:
Dopamine receptor D4
Synonyms:
DOPAMINE D2 Long DRD2 | Dopamine receptor D4
Type:
Enzyme Catalytic Domain
Mol. Mass.:
43731.97
Organism:
CANINE
Description:
Q589Y6
Residue:
421
  
Inhibitor
Name:
BDBM84637
Synonyms:
CAS_85760-74-3 NSC_54562 Quinpirole,(-) | US9359372, Quinpirole
Type:
Small organic molecule
Emp. Form.:
C13H21N3
Mol. Mass.:
219.3259
SMILES:
CCCN1CCC[C@@H]2Cc3[nH]ncc3C[C@@H]12
: