Target
Dopamine receptor D4
Ligand
BDBM50004822
Substrate
Ki
1800±n/a nM
Comments
PDSP_1719
Citation
 Van Tol, HHBunzow, JRGuan, HCSunahara, RKSeeman, PNiznik, HBCivelli, O Cloning of the gene for a human dopamine D4 receptor with high affinity for the antipsychotic clozapine. Nature 350:610-4 (1991)  
Target
Name:
Dopamine receptor D4
Synonyms:
DOPAMINE D2 Long DRD2 | Dopamine receptor D4
Type:
Enzyme Catalytic Domain
Mol. Mass.:
43731.97
Organism:
CANINE
Description:
Q589Y6
Residue:
421
  
Inhibitor
Name:
BDBM50004822
Synonyms:
(R)-1-phenyl-2,3,4,5-tetrahydro-1H-benzo[d]azepine-7,8-diol 1-Phenyl-2,3,4,5-tetrahydro-1H-benzo[d]azepine-7,8-diol 7,8-Dihydroxy-1-phenyl-2,3,4,5-tetrahydro-1H-benzo[d]azepinium(R(+)SKF38393) CHEMBL24077 SK&F-383933 SK-383933 SKF 38393 (+)
Type:
Small organic molecule
Emp. Form.:
C16H17NO2
Mol. Mass.:
255.3117
SMILES:
Oc1cc2CCNC[C@H](c3ccccc3)c2cc1O
: