Target
Gamma-aminobutyric acid type B receptor subunit 1
Ligand
BDBM50019213
Substrate
Ki
1.2±n/a nM
Comments
PDSP_543
Citation
 Massotti, MSchlichting, JLAntonacci, MDGiusti, PMemo, MCosta, EGuidotti, A gamma-Aminobutyric acidA receptor heterogeneity in rat central nervous system: studies with clonazepam and other benzodiazepine ligands. J Pharmacol Exp Ther 256:1154-60 (1991) Target
Name:
Gamma-aminobutyric acid type B receptor subunit 1
Synonyms:
GABA B GABA uptake GABA-B-R1 GABABR1 Gabbr1 | Gb1
Type:
Enzyme Catalytic Domain
Mol. Mass.:
111548.69
Organism:
Rattus norvegicus (Rat)
Description:
Q9Z0U4
Residue:
991
  
Inhibitor
Name:
BDBM50019213
Synonyms:
1,3-dihydro-7-nitro-5-(2-chlorophenyl)-2H-1,4.benzodiazepin-2-one 5-(o-chlorophenyl)-7-nitro-1,3-dihydro-2H-1,4-benzodiazepin-2-one CLONAZEPAM
Type:
Small organic molecule
Emp. Form.:
C15H10ClN3O3
Mol. Mass.:
315.711
SMILES:
[O-][N+](=O)c1ccc2NC(=O)CN=C(c3ccccc3Cl)c2c1
: