Target
Gamma-aminobutyric acid type B receptor subunit 1
Ligand
BDBM26263
Substrate
Ki
1±n/a nM
Comments
PDSP_827
Citation
 Massotti, MSchlichting, JLAntonacci, MDGiusti, PMemo, MCosta, EGuidotti, A gamma-Aminobutyric acidA receptor heterogeneity in rat central nervous system: studies with clonazepam and other benzodiazepine ligands. J Pharmacol Exp Ther 256:1154-60 (1991) Target
Name:
Gamma-aminobutyric acid type B receptor subunit 1
Synonyms:
GABA B GABA uptake GABA-B-R1 GABABR1 Gabbr1 | Gb1
Type:
Enzyme Catalytic Domain
Mol. Mass.:
111548.69
Organism:
Rattus norvegicus (Rat)
Description:
Q9Z0U4
Residue:
991
  
Inhibitor
Name:
BDBM26263
Synonyms:
Anexate FLUMAZENIL Romazicon ethyl 12-fluoro-8-methyl-9-oxo-2,4,8-triazatricyclo[8.4.0.0^{2,6}]tetradeca-1(14),3,5,10,12-pentaene-5-carboxylate
Type:
Small organic molecule
Emp. Form.:
C15H14FN3O3
Mol. Mass.:
303.2884
SMILES:
CCOC(=O)c1ncn-2c1CN(C)C(=O)c1cc(F)ccc-21
: