Target
5-hydroxytryptamine 1D receptor
Ligand
BDBM50029150
Substrate
Ki
3630.78±n/a nM
Comments
PDSP_976
Citation
 Wong, DTThrelkeld, PGRobertson, DW Affinities of fluoxetine, its enantiomers, and other inhibitors of serotonin uptake for subtypes of serotonin receptors. Neuropsychopharmacology 5:43-7 (1991) Target
Name:
5-hydroxytryptamine 1D receptor
Synonyms:
5-hydroxytryptamine 1D receptor (5HT1D) | HTR1D
Type:
Protein
Mol. Mass.:
12731.52
Organism:
Bos taurus (Bovine)
Description:
Q8MI13
Residue:
119
  
Inhibitor
Name:
BDBM50029150
Synonyms:
3-(2-Piperidin-4-yl-ethyl)-1H-indole Indalpine
Type:
Small organic molecule
Emp. Form.:
C15H20N2
Mol. Mass.:
228.3327
SMILES:
C(Cc1c[nH]c2ccccc12)C1CCNCC1
: