Target
5-hydroxytryptamine receptor 2A
Ligand
BDBM22416
Substrate
Ki
>10000±n/a nM
Comments
PDSP_1439
Citation
 Wong, DTThrelkeld, PGRobertson, DW Affinities of fluoxetine, its enantiomers, and other inhibitors of serotonin uptake for subtypes of serotonin receptors. Neuropsychopharmacology 5:43-7 (1991) Target
Name:
5-hydroxytryptamine receptor 2A
Synonyms:
5-HT-2A 5-HT2A 5-hydroxytryptamine receptor 2A (5HT2A) Htr2 Serotonin Receptor 2A
Type:
G Protein-Coupled Receptor (GPCR)
Mol. Mass.:
52852.05
Organism:
Rattus norvegicus (rat)
Description:
Rat cortex membranes 5-HT2A receptors.
Residue:
471
  
Inhibitor
Name:
BDBM22416
Synonyms:
(3S,4R)-3-[(1,3-benzodioxol-5-yloxy)methyl]-4-(4-fluorophenyl)piperidine CHEMBL490 US09969700, Paroxetine [3H]Paroxetine
Type:
radiolabeled ligand
Emp. Form.:
C19H20FNO3
Mol. Mass.:
329.3654
SMILES:
Fc1ccc(cc1)[C@@H]1CCNC[C@H]1COc1ccc2OCOc2c1
: