Target
Beta-arrestin-2
Ligand
BDBM25870
Substrate
Ki
3311.31±n/a nM
Comments
PDSP_532
Citation
 Wong, DTThrelkeld, PGRobertson, DW Affinities of fluoxetine, its enantiomers, and other inhibitors of serotonin uptake for subtypes of serotonin receptors. Neuropsychopharmacology 5:43-7 (1991) Target
Name:
Beta-arrestin-2
Synonyms:
5-HT2C ARRB2_BOVIN HTR2C
Type:
Enzyme Catalytic Domain
Mol. Mass.:
47232.00
Organism:
Beef
Description:
5-HT2C HTR2C Beef::P32120
Residue:
420
  
Inhibitor
Name:
BDBM25870
Synonyms:
1-[3-(dimethylamino)propyl]-1-(4-fluorophenyl)-1,3-dihydro-2-benzofuran-5-carbonitrile CITALOPRAM Escitalopram [3H]Cytalopram [3H]Lexapro
Type:
radiolabeled ligand
Emp. Form.:
C20H21FN2O
Mol. Mass.:
324.3919
SMILES:
CN(C)CCCC1(OCc2cc(ccc12)C#N)c1ccc(F)cc1
: