Target
Beta-arrestin-2
Ligand
BDBM50014247
Substrate
Ki
1905.46±n/a nM
Comments
PDSP_811
Citation
 Wong, DTThrelkeld, PGRobertson, DW Affinities of fluoxetine, its enantiomers, and other inhibitors of serotonin uptake for subtypes of serotonin receptors. Neuropsychopharmacology 5:43-7 (1991) Target
Name:
Beta-arrestin-2
Synonyms:
5-HT2C ARRB2_BOVIN HTR2C
Type:
Enzyme Catalytic Domain
Mol. Mass.:
47232.00
Organism:
Beef
Description:
5-HT2C HTR2C Beef::P32120
Residue:
420
  
Inhibitor
Name:
BDBM50014247
Synonyms:
(3R,4S)-3-(4-Methoxy-phenoxymethyl)-1-methyl-4-phenyl-piperidine CHEMBL94739 | Femoxetine
Type:
Small organic molecule
Emp. Form.:
C20H25NO2
Mol. Mass.:
311.418
SMILES:
COc1ccc(OC[C@H]2CN(C)CC[C@@H]2c2ccccc2)cc1
: