Target
Glutamate receptor 3
Ligand
BDBM81879
Substrate
Ki
>10000±n/a nM
Comments
PDSP_3411
Citation
 Madsen, UFerkany, JWJones, BEEbert, BJohansen, TNHolm, TKrogsgaard-Larsen, P NMDA receptor agonists derived from ibotenic acid. Preparation, neuroexcitation and neurotoxicity. Eur J Pharmacol 189:381-91 (1990)  
Target
Name:
Glutamate receptor 3
Synonyms:
GRIA3_RAT Glutamate receptor 3 Glutamate-AMPA | Gria3
Type:
Enzyme Catalytic Domain
Mol. Mass.:
100383.57
Organism:
RAT
Description:
Glutamate-AMPA GRIA3 RAT::P19492
Residue:
888
  
Inhibitor
Name:
BDBM81879
Synonyms:
4-HPCA CAS_129091 | NSC_129091
Type:
Small organic molecule
Emp. Form.:
C7H8N2O4
Mol. Mass.:
184.1494
SMILES:
OC(=O)C1NCCc2o[nH]c(=O)c12
: