Target
5-hydroxytryptamine receptor 1B
Ligand
BDBM25758
Substrate
Ki
1995.26±n/a nM
Comments
PDSP_1057
Citation
 Tsuchihashi, HNakashima, YKinami, JNagatomo, T Characteristics of 125I-iodocyanopindolol binding to beta-adrenergic and serotonin-1B receptors of rat brain: selectivity of beta-adrenergic agents. Jpn J Pharmacol 52:195-200 (1990)  
Target
Name:
5-hydroxytryptamine receptor 1B
Synonyms:
5-HT-1B 5-hydroxytryptamine receptor 1B (5HT1B) 5ht1b Serotonin 1 (5-HT1) receptor Serotonin receptor 1B
Type:
Protein
Mol. Mass.:
43173.33
Organism:
Rattus norvegicus (Rat)
Description:
P28564
Residue:
386
  
Inhibitor
Name:
BDBM25758
Synonyms:
2-hydroxy-5-{1-hydroxy-2-[(4-phenylbutan-2-yl)amino]ethyl}benzamide Labetolol labetalol
Type:
Small organic molecule
Emp. Form.:
C19H24N2O3
Mol. Mass.:
328.4055
SMILES:
CC(CCc1ccccc1)NCC(O)c1ccc(O)c(c1)C(N)=O
: