Target
5-hydroxytryptamine receptor 1B
Ligand
BDBM25749
Substrate
Ki
>10000±n/a nM
Comments
PDSP_1523
Citation
 Tsuchihashi, HNakashima, YKinami, JNagatomo, T Characteristics of 125I-iodocyanopindolol binding to beta-adrenergic and serotonin-1B receptors of rat brain: selectivity of beta-adrenergic agents. Jpn J Pharmacol 52:195-200 (1990)  
Target
Name:
5-hydroxytryptamine receptor 1B
Synonyms:
5-HT-1B 5-hydroxytryptamine receptor 1B (5HT1B) 5ht1b Serotonin 1 (5-HT1) receptor Serotonin receptor 1B
Type:
Protein
Mol. Mass.:
43173.33
Organism:
Rattus norvegicus (Rat)
Description:
P28564
Residue:
386
  
Inhibitor
Name:
BDBM25749
Synonyms:
CHEMBL6995 Practolol Practolol,(-)
Type:
Small organic molecule
Emp. Form.:
C14H22N2O3
Mol. Mass.:
266.3361
SMILES:
CC(C)NCC(O)COc1ccc(NC(C)=O)cc1
: