Target
Beta-1 adrenergic receptor
Ligand
BDBM25755
Substrate
Ki
125.89±n/a nM
Comments
PDSP_6655
Citation
 Tsuchihashi, HNakashima, YKinami, JNagatomo, T Characteristics of 125I-iodocyanopindolol binding to beta-adrenergic and serotonin-1B receptors of rat brain: selectivity of beta-adrenergic agents. Jpn J Pharmacol 52:195-200 (1990)  
Target
Name:
Beta-1 adrenergic receptor
Synonyms:
ADRB1R, B1AR Adrb1 Adrenergic receptor beta Beta-1 adrenoreceptor adrenergic Beta1,2
Type:
Protein
Mol. Mass.:
50486.84
Organism:
Rattus norvegicus (Rat)
Description:
P18090
Residue:
466
  
Inhibitor
Name:
BDBM25755
Synonyms:
Acebutolol N-{3-acetyl-4-[2-hydroxy-3-(propan-2-ylamino)propoxy]phenyl}butanamide | Neptal
Type:
Small organic molecule
Emp. Form.:
C18H28N2O4
Mol. Mass.:
336.4259
SMILES:
CCCC(=O)Nc1ccc(OCC(O)CNC(C)C)c(c1)C(C)=O
: