Target
Beta-1 adrenergic receptor
Ligand
BDBM25752
Substrate
Ki
12.30±n/a nM
Comments
PDSP_360
Citation
 Tsuchihashi, HNakashima, YKinami, JNagatomo, T Characteristics of 125I-iodocyanopindolol binding to beta-adrenergic and serotonin-1B receptors of rat brain: selectivity of beta-adrenergic agents. Jpn J Pharmacol 52:195-200 (1990)  
Target
Name:
Beta-1 adrenergic receptor
Synonyms:
ADRB1R, B1AR Adrb1 Adrenergic receptor beta Beta-1 adrenoreceptor adrenergic Beta1,2
Type:
Protein
Mol. Mass.:
50486.84
Organism:
Rattus norvegicus (Rat)
Description:
P18090
Residue:
466
  
Inhibitor
Name:
BDBM25752
Synonyms:
Betaxolol [(2S)-3-{4-[2-(cyclopropylmethoxy)ethyl]phenoxy}-2-hydroxypropyl](propan-2-yl)amine
Type:
Small organic molecule
Emp. Form.:
C18H29NO3
Mol. Mass.:
307.4278
SMILES:
CC(C)NC[C@H](O)COc1ccc(CCOCC2CC2)cc1
: