Target
D(3) dopamine receptor
Ligand
BDBM50025206
Substrate
Ki
0.91±n/a nM
Comments
PDSP_1863
Citation
 Sokoloff, PGiros, BMartres, MPBouthenet, MLSchwartz, JC Molecular cloning and characterization of a novel dopamine receptor (D3) as a target for neuroleptics. Nature 347:146-51 (1990)  
Target
Name:
D(3) dopamine receptor
Synonyms:
DOPAMINE D3 Dopamine D3 receptor | Drd3
Type:
Protein
Mol. Mass.:
49540.58
Organism:
Rattus norvegicus (Rat)
Description:
P19020
Residue:
446
  
Inhibitor
Name:
BDBM50025206
Synonyms:
(6,7-Dihydroxy-1,2,3,4-tetrahydro-naphthalen-2-yl)-dimethyl-ammonium | TL99
Type:
Small organic molecule
Emp. Form.:
C12H18NO2
Mol. Mass.:
208.2763
SMILES:
C[NH+](C)C1CCc2cc(O)c(O)cc2C1
: