Target
D(3) dopamine receptor
Ligand
BDBM81792
Substrate
Ki
9.2±n/a nM
Comments
PDSP_1942
Citation
 Sokoloff, PGiros, BMartres, MPBouthenet, MLSchwartz, JC Molecular cloning and characterization of a novel dopamine receptor (D3) as a target for neuroleptics. Nature 347:146-51 (1990)  
Target
Name:
D(3) dopamine receptor
Synonyms:
DOPAMINE D3 Dopamine D3 receptor | Drd3
Type:
Protein
Mol. Mass.:
49540.58
Organism:
Rattus norvegicus (Rat)
Description:
P19020
Residue:
446
  
Inhibitor
Name:
BDBM81792
Synonyms:
CAS_5311190 UH232 | UH232(+)
Type:
Small organic molecule
Emp. Form.:
C18H27NO
Mol. Mass.:
273.4131
SMILES:
CCCN(CCC)C1C=Cc2c(OC)cccc2C1C
: