Target
5-hydroxytryptamine 1D receptor
Ligand
BDBM50035057
Substrate
Ki
390±n/a nM
Comments
PDSP_779
Citation
 Schipper, JTulp, MTSijbesma, H Neurochemical profile of eltoprazine. Drug Metabol Drug Interact 8:85-114 (1990)  
Target
Name:
5-hydroxytryptamine 1D receptor
Synonyms:
5-hydroxytryptamine 1D receptor (5HT1D) | HTR1D
Type:
Protein
Mol. Mass.:
12731.52
Organism:
Bos taurus (Bovine)
Description:
Q8MI13
Residue:
119
  
Inhibitor
Name:
BDBM50035057
Synonyms:
(eltoprazine)1-(2,3-Dihydro-benzo[1,4]dioxin-5-yl)-piperazine CHEMBL282614 | Eltoprazine
Type:
Small organic molecule
Emp. Form.:
C12H16N2O2
Mol. Mass.:
220.2676
SMILES:
C1CN(CCN1)c1cccc2OCCOc12
: