Target
Histamine H1 receptor
Ligand
BDBM50035057
Substrate
Ki
3900±n/a nM
Comments
PDSP_779
Citation
 Schipper, JTulp, MTSijbesma, H Neurochemical profile of eltoprazine. Drug Metabol Drug Interact 8:85-114 (1990)  
Target
Name:
Histamine H1 receptor
Synonyms:
HISTAMINE H1 Hrh1
Type:
Enzyme Catalytic Domain
Mol. Mass.:
55716.35
Organism:
RAT
Description:
HISTAMINE H1 HRH1 RAT::P31390
Residue:
486
  
Inhibitor
Name:
BDBM50035057
Synonyms:
(eltoprazine)1-(2,3-Dihydro-benzo[1,4]dioxin-5-yl)-piperazine CHEMBL282614 | Eltoprazine
Type:
Small organic molecule
Emp. Form.:
C12H16N2O2
Mol. Mass.:
220.2676
SMILES:
C1CN(CCN1)c1cccc2OCCOc12
: