Target
Vasopressin V2 receptor
Ligand
BDBM81890
Substrate
Ki
3100±n/a nM
Comments
PDSP_1040
Citation
 Pettibone, DJClineschmidt, BVLis, EVReiss, DRTotaro, JAWoyden, CJBock, MGFreidinger, RMTung, RDVeber, DF In vitro pharmacological profile of a novel structural class of oxytocin antagonists. J Pharmacol Exp Ther 256:304-8 (1991) Target
Name:
Vasopressin V2 receptor
Synonyms:
AVPR V2 Avpr2 V2R_RAT Vasopressin receptor
Type:
G-protein coupled receptor
Mol. Mass.:
40761.85
Organism:
Rattus norvegicus (Rat)
Description:
Residue:
371
  
Inhibitor
Name:
BDBM81890
Synonyms:
CAS_196819 NSC_196819
Type:
Small organic molecule
Emp. Form.:
C40H53N9O6
Mol. Mass.:
755.9055
SMILES:
CC(C=C)C(NC(=O)C(Cc1c[nH]c2ccccc12)NC(=O)C1CCCN1C(=O)C(N)Cc1cnc[nH]1)C(=O)N1CCCCC1(C=O)C(=O)N1CCCCC1
: