Target
Muscarinic acetylcholine receptor M2
Ligand
BDBM81898
Substrate
Ki
20.89±n/a nM
Comments
PDSP_2383
Citation
 Dörje, FWess, JLambrecht, GTacke, RMutschler, EBrann, MR Antagonist binding profiles of five cloned human muscarinic receptor subtypes. J Pharmacol Exp Ther 256:727-33 (1991) Target
Name:
Muscarinic acetylcholine receptor M2
Synonyms:
ACM2_HUMAN Cholinergic, muscarinic M2 Muscarinic acetylcholine receptor M2 and M5 | RecName: Full=Muscarinic acetylcholine receptor M2
Type:
GPCR
Mol. Mass.:
51730.61
Organism:
Homo sapiens (Human)
Description:
P08172
Residue:
466
  
Inhibitor
Name:
BDBM81898
Synonyms:
(R)-Hexbutinol CAS_2054312 NSC_2054312 | NSC_2054314
Type:
Small organic molecule
Emp. Form.:
C21H29NO
Mol. Mass.:
311.4611
SMILES:
OC(C#CCN1CCCCC1)(C1CCCCC1)c1ccccc1
: