Target
Muscarinic acetylcholine receptor M4
Ligand
BDBM81898
Substrate
Ki
3.02±n/a nM
Comments
PDSP_2383
Citation
 Dörje, FWess, JLambrecht, GTacke, RMutschler, EBrann, MR Antagonist binding profiles of five cloned human muscarinic receptor subtypes. J Pharmacol Exp Ther 256:727-33 (1991) Target
Name:
Muscarinic acetylcholine receptor M4
Synonyms:
ACM4_HUMAN Cholinergic, muscarinic M4 Muscarinic acetylcholine receptor M2 and M4
Type:
Enzyme Catalytic Domain
Mol. Mass.:
53079.31
Organism:
Homo sapiens (Human)
Description:
Cholinergic, muscarinic M4 CHRM4 HUMAN M3::P08173
Residue:
479
  
Inhibitor
Name:
BDBM81898
Synonyms:
(R)-Hexbutinol CAS_2054312 NSC_2054312 | NSC_2054314
Type:
Small organic molecule
Emp. Form.:
C21H29NO
Mol. Mass.:
311.4611
SMILES:
OC(C#CCN1CCCCC1)(C1CCCCC1)c1ccccc1
: